{"text_format":"1","workbook":"xlsx","n_sheets":6,"sheets":["Input og resultat","IDF","Kommuneliste","Tables","help1","help3"],"not_rendered":{"charts":0,"images":4,"macros":1,"external_links":0,"defined_names":45,"comments":0,"pivot_tables":0},"unopened":[],"bounds":{"document_bytes":16777216,"sheet_cells":100000,"rows_first":2000,"rows_last":500,"rows_between":2000,"halvings":0,"cell_chars":16384,"cell_head_chars":4096},"cells_cut":0,"cells_raw":0,"read":"whole","date_system":"1900"}

{"sheet":"Input og resultat","index":0,"n_rows":54,"n_cols":10,"rows_kept":54,"cut":false,"hidden":false,"merged":[]}
["Nedbørskarakteristika",null,null,null,null,null,null,null,"Pil ikke - intern beregning"]
["Kommune","Halsnæs",null,null,null,null,null,null,"Afskærende lednings kapacitet l/s",2]
[null," ",null,null,null,null,null,null,"Volumen m³",{"$f":"IDF!M15","v":23.058614016749367}]
["Designkarakteristika",null,null,null,null,null,null,null,"Total opland (m²)",1000]
["Gentagelsesperiode (år)",10,"år"]
["Sikkerhedsfaktor (klima, fremtidig udbygning, etc)",1.07,null,null,null,"Beregningstjek","Vol m³","Dræn kap l/s","Iterationsafstand","Antal iterationer"]
["Oplandskarakteristika",null,null,null,"Faskine",{"$f":"IF(ABS((H7-B20)/H7)<0.001,\"OK\",\"Beregn\")","v":"OK"},12.050163322383671,6.9969424225596558E-2,6.7903949547165382E-4,6]
["Befæstet areal (m²)",250,"m²",null,"Regnbed",{"$f":"IF(ABS((H8-B26)/H8)<0.001,\"OK\",\"Beregn\")","v":"OK"},11.187860186639966,0.125,0,1]
[null,null,null,null,"Grøft",{"$f":"IF(ABS((H9-B35)/H9)<0.001,\"OK\",\"Beregn\")","v":"OK"},12.12702796583072,0.13885745701961252,5.24378863425141E-4,2]
["Jord- og nedsivningskarakteristika ",null,null,null,"Perm. bel.",{"$f":"IF(ABS((H10-B44)/H10)<0.001,\"OK\",\"Beregn\")","v":"OK"},23.147048361451429,2,0,1]
["K (Hydraulisk  ledningsevne) - se evt måling nederst ",5.0000000000000004E-6,"m/s"]
[]
[]
["Faskine",null,null,null,"Hjælpestørrelser, faskine",null,null,null,"Dimensionerende kasseregn, Afløbsteknik s. 269"]
["Bredde",1,"m",null,"Opstuvningsvolumen",null,{"$f":"F_bredde*F_hojde*F_hulrum*F_laengde","v":12.050163322383669}," [m³]","Vr,k (mm)",40.167211074612233]
["Højde",1.3,"m",null,"Faskine volumen ",null,{"$f":"G15/F_hulrum","v":12.684382444614389}," [m³]","Varighed (h)",13.660658717668166]
["Hulrums andel i faskine [Plast: 0,95, sten: 0,25]",0.95,"0-1",null,"Regn, der holdes umiddelbart",null,{"$f":"G15/B8*1000","v":48.200653289534678}," [mm]"]
["Udsivning i faskinebund: 0=Nej ,1=ja",0,null,null,"Regn, der siver pr døgn ",null,{"$f":"B20*86400/B8","v":24.165012864293672}," [mm/døgn]","Karakteritika for dimensionerende kasseregn"]
["Længde faskine",{"$f":"G7/(B15*B16*B17)","v":9.7572172650879931},"m",null,"Tømmetid",{"$f":"ROUND(G19/60/60,0)","v":48},{"$f":"G15/(B20/1000)","v":172337.43957030264}," [s]","Samlet nedbør (mm)",{"$f":"J15+G18/24*J16","v":53.921794143244597}]
["Dræn kapacitet, gennemsnit",{"$f":"((B19+B15)*B16+B18*B19*B15)*B11*1000","v":6.9921912223071966E-2},"l/s",null,"Afløbstal ",null,{"$f":"B20/B8*10000","v":2.7968764889228788},"[l/sek/ha]","Intensitet (l/sek/ha)",{"$f":"J19*10000/(J16*3600)","v":10.964534332102856}]
{"$rows_left_out":35}
{"sheet":"IDF","index":1,"n_rows":69,"n_cols":35,"rows_kept":69,"cut":false,"hidden":false,"merged":[]}
[null,null,null,null,null,null,null,null,null,null,null,null,"Bassindimensionering opstrøms udløb",null,null,null,null,null,null,"Regression",null,null,null,null,null,null,null,null,null,"Sæt optimering i gang"]
[null,null,null,null,null,null,null,null,null,null,null,null,"Oplandskarakteristika",null,null,null,null,null,null,null,null,null,null,null,null,null,null,null,null,"Initdummy"]
[null,null,null,null,null,null,null,null,null,null,null,null,"Befæstet areal (ha)",null,null,null,{"$f":"'Input og resultat'!J4/10000","v":0.1},null,null,"Estimates, 3 parameters:",null,null,null,null,null,null,null,null,null,{"$f":"initdummy(B3,B4,B8,B9,B10,I3,I4,I5,Q3,Q4,Q5)","v":1}]
[null,null,null,null,null,null,null,null,null,null,null,null,"Hydrologisk reduktionsfaktor (-)",null,null,null,1,null,null,"Alpha",{"$f":"EXP(X22/10+U7*W22/10)","v":163.07240857571966}]
["Årsmiddelnedbør [mm]",{"$f":"VLOOKUP('Input og resultat'!B2,Kommuneliste!A3:C101,2,FALSE)","v":659.18675445029498},"Fås fra kommunelisten",null,null,null,null,null,null,null,null,null,"Afskærende lednings kapacitet (l/s)",null,null,null,{"$f":"'Input og resultat'!J2","v":2},null,null,"Theta",{"$f":"AD11","v":4.3981942860717762},null,null,null,null,null,null,null,null,"idftheta","theta"]
["Middelværdi Klimagrid [mm/dag]",{"$f":"VLOOKUP('Input og resultat'!B2,Kommuneliste!A3:C101,3,FALSE)","v":28.521069588601001},"Fås fra kommunelisten"]
[null,null,null,null,null,null,null,null,null,null,null,null,null,null,null,null,null,null,null,"Nu",{"$f":"-(Z22-W22*X22/10)/(Y22-W22^2/10)","v":0.74475786605297745},null,null,null,null,null,null,null,null,{"$f":"idftheta(AE7)","v":9.9075739476169628E-2},1]
["Gentagelsesperiode (år)",{"$f":"'Input og resultat'!B5","v":10},{"$f":"IF(B8<1/help1!C11,CONCATENATE(\" Fejl: Indtast gentagelsesperiode > \",ROUND(1/help1!C11,2),\" år\"),\" \")","v":" "},null,null,null,null,null,null,null,null,null,"NB. Frekvens- og sikkerhedsfaktorer på regnen ",null,null,null,null,null,null,null,null,null,null,null,null,null,null,null,null,"derividf","x"]
["Sikkerhedsfaktor (Fra Skrift 27)",{"$f":"'Input og resultat'!B6","v":1.07},"Defineret i Skrift 27, Faktor til beskrivelse af usikkerhed, klima, mv. Typisk 1.0 - 1.8",null,null,null,null,null,null,null,null,null,"indgår ved beregning af bassinvolumen",null,null,null,null,null,null,"Dur (min)","Intensity","ln(dur)","ln(dur+Theta)","ln(int)","ln(dur+Theta)^2","ln(dur+Theta)*ln(int)","Est. Intensity","Obj.Func",null,{"$f":"derividf(AE9)","v":-8.3219099611397951E-2},{"$f":"AE7","v":1}]
[null,null,null,null,null,null,null,null,null,null,null,null,null,null,null,null,null,null,null,null,null,null,null,null,null,null,null,null,null,"bisectidf","min","max","middel","tiny"]
[null,null,null,null,null,null,null,null,null,null,null,null,null,null,null,null,null,null,null,{"$f":"IDF!A19","v":2},{"$f":"IDF!D19","v":40.673801348523611},{"$f":"LN(T11)","v":0.69314718055994529},{"$f":"LN(T11+$U$5)","v":1.8560158077545728},{"$f":"LN(U11)","v":3.7055841836733063},{"$f":"W11^2","v":3.4447946786348593},{"$f":"W11*X11","v":6.8776228218629809},{"$f":"$U$4*(T11+$U$5)^(-$U$7)","v":40.931991854157822},{"$f":"(LN(U11)-LN(AA11))^2","v":4.0040680032727892E-5},null,{"$f":"bisectidf(AE11,AF11,AG11,AH11)","v":4.3981942860717762},0,60,{"$f":"(AE11+AF11)/2","v":30},{"$f":"AD3/100000","v":1.0000000000000001E-5}]
[null,null,null,null,null,null,null,null,null,null,null,null,null,null,null,null,null,null,null,{"$f":"IDF!A20","v":5},{"$f":"IDF!D20","v":30.881944396854809},1.6094379124341003,2.2405175735965162,3.4301716893936778,5.0199189975948197,7.6853599505397856,30.739585058383376,2.1348556357808086E-5]
[null,null,null,null,null,null,null,null,null,null,null,null,null,null,null,null,null,null,null,{"$f":"IDF!A21","v":10},{"$f":"IDF!D21","v":22.386052249384726},2.3025850929940459,2.6671028019185479,3.108438097484933,7.1134373560017687,8.2905239593924254,22.372858168326747,3.4758361888183133E-7]
["Design regnkurve",null,null,null,null,null,null,null,null,null,null,null,"Volumen af bassin",null,null,null,null,null,null,{"$f":"IDF!A22","v":30},{"$f":"IDF!D22","v":11.781757267302678},3.4011973816621555,3.5380040713176562,2.4665523408929309,12.51747280866031,8.7266722241972854,11.695895453555211,5.3500104680592075E-5]
[null,null,null,null,null,null,null,null,null,null,null,null,{"$f":"Q24*Q27*12","v":23.058614016749367},"m3",{"$f":"IF(Y27>0.1,\"ADVARSEL: Programmet har muligvis ikke optimeret korrekt\",\" \")","v":"ADVARSEL: Programmet har muligvis ikke optimeret korrekt"},null,null,null,null,{"$f":"IDF!A23","v":60},{"$f":"IDF!D23","v":7.1899907919503994},4.0943445622221004,4.165085593681054,1.9726898910576429,17.347938002689457,8.2164222460444361,7.331748794614664,3.811934806428268E-4]
["Varighed","zT","S{zT}","f*zT","Regression",null,null,null,null,null,null,null,"Effekten af koblede regn ER inkluderet (20 % ekstra volumen)",null,null,null,null,null,null,{"$f":"IDF!A24","v":180},{"$f":"IDF!D24","v":3.322754660601368},5.1929568508902104,5.2170975186996662,1.200794155952094,27.218106519622214,6.2646602114867296,3.3491946419341976,6.2817601673931061E-5]
["(min)","(mm/s)","(mm/s)","(mm/s)","(mm/s)",null,null,null,null,null,null,null,null,null,null,null,null,null,null,{"$f":"IDF!A25","v":360},{"$f":"IDF!D25","v":2.0372096491989216},5.8861040314501558,5.8982472100663683,0.71158105251764581,34.789320151055698,4.1970809577482946,2.0166310477325498,1.030779585429544E-4]
[null,null,null,null,null,null,null,null,null,null,null,null,null,null,null,null,null,null,null,{"$f":"IDF!A26","v":720},{"$f":"IDF!D26","v":1.2437912745770388},6.5792512120101012,6.5853412333033239,0.21816419452961489,43.366719159044941,1.4366856658662803,1.2088985338321732,8.0966153612471476E-4]
[2,{"$f":"help1!B18","v":38.012898456564123},{"$f":"help1!C18","v":2.0958328111849984},{"$f":"$B$9*B19","v":40.673801348523611},{"$f":"IDF!$U$4*(A19+IDF!$U$5)^(-IDF!$U$7)","v":40.931991854157822},null,null,null,null,null,null,null,null,null,null,null,null,null,null,{"$f":"IDF!A27","v":1440},{"$f":"IDF!D27","v":0.7361428605232021},7.2723983925700466,7.275448039254413,-0.30633107511725738,52.932144171890883,-2.2286958198245466,0.72306740632674815,3.2118928858571901E-4]
[5,{"$f":"help1!B19","v":28.861630277434401},{"$f":"help1!C19","v":1.3804952976629403},30.881944396854809,{"$f":"IDF!$U$4*(A20+IDF!$U$5)^(-IDF!$U$7)","v":30.739585058383376},null,null,null,null,null,null,null,null,null,null,null,null,null,null,{"$f":"IDF!A28","v":2880},{"$f":"IDF!D28","v":0.41702020280454744},7.965545573129992,7.9670715590148369,-0.87462061038436489,63.474229226463102,-6.9681649899214699,0.43199343551352615,1.2443767009263139E-3]
{"$rows_left_out":50}
{"sheet":"Kommuneliste","index":2,"n_rows":101,"n_cols":6,"rows_kept":101,"cut":false,"hidden":false,"merged":[]}
[null,"Årsmiddelnedbør","Middelværdi Klimagrid","Northing","Easting","Faskinebund"]
["Kommuner","mm","mm/dag","m","m","Nej/ja"]
["Albertslund",640.93120613344104,27.883887816645199,6175140,710791,0]
["Allerød",685.90148109916402,27.980664954474399,6195096,707641,1]
["Assens",715.00320983031304,25.8390130749906,6126050,565439]
["Ballerup",658.35836399584298,28.203187564974399,6181137,710019]
["Billund",888.55226207130499,26.431787823322999,6177641,498323]
["Bornholm",694.85653734071695,28.977950787728101,6126753,877619]
["Brøndby",637.69404606863304,27.704196220811799,6171287,714637]
["Brønderslev",756.59296932385598,27.067365368482601,6340900,565980]
["Christiansø",575.92674548849095,29.351724032698002,6148265,892218]
["Dragør",608.69892604858796,26.9475763886701,6164631,729202]
["Egedal",640.48044867487999,28.322975651501402,6184288,702479]
["Esbjerg",836.22271448582501,25.106513539742998,6140331,475667]
["Fanø",806.00790372292499,25.148578761261501,6140167,463990]
["Favrskov",670.50951171173097,24.9798061927643,6241884,558870]
["Faxe",650.68927764681098,26.784458755737699,6128922,694309]
["Fredensborg",722.50273138104399,27.484682690605101,6205785,715168]
["Fredericia",745.09731787026499,24.8424444364599,6158304,544664]
["Frederiksberg",639.26087634107103,26.930061600356002,6176349,721564]
{"$rows_left_out":82}
{"sheet":"Tables","index":3,"n_rows":47,"n_cols":12,"rows_kept":47,"cut":false,"hidden":true,"merged":[]}
["LAMBDA"]
[]
["Variabel","b_0","b_1","V(b_0)","Cov","V(b_1)","Res.var.",null,"E(lambda)","V(lambda)",null,"z_0"]
["i1m",0.41959999999999997,5.8669999999999998E-3,1.018,-1.4239999999999999E-3,2.052E-6,0.25850000000000001,null,{"$f":"B4+C4*IDF!$B$5","v":4.2870486883598806},{"$f":"D4+2*E4*IDF!$B$5+F4*IDF!$B$5^2+G4","v":0.29078589102760816},null,16.7]
["i2m",0.82350000000000001,3.5630000000000002E-3,0.47949999999999998,-6.5200000000000002E-4,9.3379999999999996E-7,7.1230000000000002E-2,null,{"$f":"B5+C5*IDF!$B$5","v":3.1721824061064012},{"$f":"D5+2*E5*IDF!$B$5+F5*IDF!$B$5^2+G5","v":9.6911950306061131E-2},null,14.9]
["i5m",1.476,2.3579999999999999E-3,0.42599999999999999,-5.7839999999999996E-4,8.2880000000000001E-7,5.9540000000000003E-2,null,{"$f":"B6+C6*IDF!$B$5","v":3.0303623669937956},{"$f":"D6+2*E6*IDF!$B$5+F6*IDF!$B$5^2+G6","v":8.3128886950659814E-2},null,10.6]
["i10m",1.849,1.6169999999999999E-3,0.48909999999999998,-6.7159999999999995E-4,9.6059999999999996E-7,7.8719999999999998E-2,null,{"$f":"B7+C7*IDF!$B$5","v":2.914904981946127},{"$f":"D7+2*E7*IDF!$B$5+F7*IDF!$B$5^2+G7","v":9.9807157881714445E-2},null,7.34]
["i30m",1.825,1.6080000000000001E-3,0.42620000000000002,-5.7779999999999995E-4,8.2529999999999996E-7,5.4339999999999999E-2,null,{"$f":"B8+C8*IDF!$B$5","v":2.8849723011560746},{"$f":"D8+2*E8*IDF!$B$5+F8*IDF!$B$5^2+G8","v":7.7399065935650657E-2},null,3.74]
["i60m",2.0720000000000001,1.2160000000000001E-3,0.51719999999999999,-7.0540000000000002E-4,1.0049999999999999E-6,7.3260000000000006E-2,null,{"$f":"B9+C9*IDF!$B$5","v":2.8735710934115586},{"$f":"D9+2*E9*IDF!$B$5+F9*IDF!$B$5^2+G9","v":9.7179139950450813E-2},null,2.39]
["i3h",1.1970000000000001,2.4870000000000001E-3,0.63429999999999997,-8.7089999999999997E-4,1.238E-6,9.6589999999999995E-2,null,{"$f":"B10+C10*IDF!$B$5","v":2.8363974583178839},{"$f":"D10+2*E10*IDF!$B$5+F10*IDF!$B$5^2+G10","v":0.12066315652495556},null,1.19]
["i6h",6.1269999999999998E-2,4.1479999999999998E-3,0.77590000000000003,-1.07E-3,1.522E-6,0.13669999999999999,null,{"$f":"B11+C11*IDF!$B$5","v":2.7955766574598235},{"$f":"D11+2*E11*IDF!$B$5+F11*IDF!$B$5^2+G11","v":0.16329070923977879},null,0.753]
["i12h",-1.19,5.986E-3,0.72199999999999998,-9.8970000000000004E-4,1.407E-6,0.1183,null,{"$f":"B12+C12*IDF!$B$5","v":2.7558919121394658},{"$f":"D12+2*E12*IDF!$B$5+F12*IDF!$B$5^2+G12","v":0.14688547662158408},null,0.45300000000000001]
["i24h",-2.3260000000000001,7.5890000000000003E-3,0.66320000000000001,-9.0609999999999996E-4,1.288E-6,0.1028,null,{"$f":"B13+C13*IDF!$B$5","v":2.676568279523289},{"$f":"D13+2*E13*IDF!$B$5+F13*IDF!$B$5^2+G13","v":0.13109276787379054},null,0.26700000000000002]
["i48h",-3.6629999999999998,9.5809999999999992E-3,0.48449999999999999,-6.5379999999999995E-4,9.3030000000000001E-7,5.6930000000000001E-2,null,{"$f":"B14+C14*IDF!$B$5","v":2.6526682943882762},{"$f":"D14+2*E14*IDF!$B$5+F14*IDF!$B$5^2+G14","v":8.3718032869690678E-2},null,0.16]
[]
[]
["MEAN"]
[]
["Variabel","b_0","b_1","V(b_0)","Cov","V(b_1)","Res.var.",null,"E(Mean)","V(Mean)"]
["i1m",5.3940000000000001,0,1.7299999999999999E-2,0,0,0.16270000000000001,null,{"$f":"B20+C20*IDF!$B$6","v":5.3940000000000001},{"$f":"D20+2*E20*IDF!$B$6+F20*IDF!$B$6^2+G20","v":0.18000000000000002}]
{"$rows_left_out":28}
{"sheet":"help1","index":4,"n_rows":27,"n_cols":23,"rows_kept":27,"cut":false,"hidden":true,"merged":[]}
["Variable","i1m",null,"i2m",null,"i5m",null,"i10m",null,"i30m",null,"i60m",null,"i3h",null,"i6h",null,"i12h",null,"i24h",null,"i48h"]
[]
["q0",{"$f":"Tables!$L$4","v":16.7},null,{"$f":"Tables!$L$5","v":14.9},null,{"$f":"Tables!$L$6","v":10.6},null,{"$f":"Tables!$L$7","v":7.34},null,{"$f":"Tables!$L$8","v":3.74},null,{"$f":"Tables!$L$9","v":2.39},null,{"$f":"Tables!$L$10","v":1.19},null,{"$f":"Tables!$L$11","v":0.753},null,{"$f":"Tables!$L$12","v":0.45300000000000001},null,{"$f":"Tables!$L$13","v":0.26700000000000002},null,{"$f":"Tables!$L$14","v":0.16}]
["lambda",{"$f":"Tables!$I$4","v":4.2870486883598806},null,{"$f":"Tables!$I$5","v":3.1721824061064012},null,{"$f":"Tables!$I$6","v":3.0303623669937956},null,{"$f":"Tables!$I$7","v":2.914904981946127},null,{"$f":"Tables!$I$8","v":2.8849723011560746},null,{"$f":"Tables!$I$9","v":2.8735710934115586},null,{"$f":"Tables!$I$10","v":2.8363974583178839},null,{"$f":"Tables!$I$11","v":2.7955766574598235},null,{"$f":"Tables!$I$12","v":2.7558919121394658},null,{"$f":"Tables!$I$13","v":2.676568279523289},null,{"$f":"Tables!$I$14","v":2.6526682943882762}]
["mean",{"$f":"Tables!$I$20","v":5.3940000000000001},null,{"$f":"Tables!I21","v":5.6879999999999997},null,{"$f":"Tables!I22","v":4.7910000000000004},null,{"$f":"Tables!I23","v":3.8769999999999998},null,{"$f":"Tables!I24","v":1.9510000000000001},null,{"$f":"Tables!I25","v":1.163},null,{"$f":"Tables!I26","v":0.5195423408610047},null,{"$f":"Tables!I27","v":0.31323618042271467},null,{"$f":"Tables!I28","v":0.19462892913473537},null,{"$f":"Tables!I29","v":0.11825640522631164},null,{"$f":"Tables!I30","v":6.6937202322134612E-2}]
["kappa",{"$f":"Tables!$E$37","v":-0.38761689777491126},null,{"$f":"Tables!$E$38","v":-0.22883457314913214},null,{"$f":"Tables!$E$39","v":-0.16007359705611779},null,{"$f":"Tables!$E$40","v":-5.5609566400933286E-2},null,{"$f":"Tables!$E$41","v":-0.15430047988187501},null,{"$f":"Tables!$E$42","v":-0.15498154981549828},null,{"$f":"Tables!$E$43","v":-0.14746202297147071},null,{"$f":"Tables!$E$44","v":-0.15088757396449681},null,{"$f":"Tables!$E$45","v":-0.14677538917716815},null,{"$f":"Tables!$E$46","v":-0.12628817687839589},null,{"$f":"Tables!$E$47","v":-7.2474942174248325E-2}]
["V_lambda",{"$f":"Tables!$J$4","v":0.29078589102760816},null,{"$f":"Tables!$J$5","v":9.6911950306061131E-2},null,{"$f":"Tables!$J$6","v":8.3128886950659814E-2},null,{"$f":"Tables!$J$7","v":9.9807157881714445E-2},null,{"$f":"Tables!$J$8","v":7.7399065935650657E-2},null,{"$f":"Tables!$J$9","v":9.7179139950450813E-2},null,{"$f":"Tables!$J$10","v":0.12066315652495556},null,{"$f":"Tables!$J$11","v":0.16329070923977879},null,{"$f":"Tables!$J$12","v":0.14688547662158408},null,{"$f":"Tables!$J$13","v":0.13109276787379054},null,{"$f":"Tables!$J$14","v":8.3718032869690678E-2}]
["V_mean",{"$f":"Tables!$J$20","v":0.18000000000000002},null,{"$f":"Tables!J21","v":0.18903},null,{"$f":"Tables!J22","v":8.2559999999999995E-2},null,{"$f":"Tables!J23","v":1.7673000000000001E-2},null,{"$f":"Tables!J24","v":1.3122E-2},null,{"$f":"Tables!J25","v":8.0800000000000004E-3},null,{"$f":"Tables!J26","v":1.948419350847032E-3},null,{"$f":"Tables!J27","v":5.0627241227718905E-4},null,{"$f":"Tables!J28","v":1.3253161007976874E-4},null,{"$f":"Tables!J29","v":8.8952072978100937E-5},null,{"$f":"Tables!J30","v":3.1298221282644549E-5}]
["V_kappa",{"$f":"Tables!$G$37","v":1.4038136110986709E-3},null,{"$f":"Tables!$G$38","v":1.8127008175339125E-4},null,{"$f":"Tables!$G$39","v":2.334494393717262E-4},null,{"$f":"Tables!$G$40","v":3.0987973834140802E-4},null,{"$f":"Tables!$G$41","v":4.7441114641346201E-3},null,{"$f":"Tables!$G$42","v":4.5644539998475264E-3},null,{"$f":"Tables!$G$43","v":6.0738716519302344E-3},null,{"$f":"Tables!$G$44","v":4.7477326760208931E-4},null,{"$f":"Tables!$G$45","v":1.2314385207223388E-3},null,{"$f":"Tables!$G$46","v":6.1887282090410253E-4},null,{"$f":"Tables!$G$47","v":1.852476239110656E-3}]
[]
["Min Lanbda",null,{"$f":"MIN(B4:V4)","v":2.6526682943882762}]
[]
["T","z_T","S(z_T)","z_T","S(z_T)","z_T","S(z_T)","z_T","S(z_T)","z_T","S(z_T)","z_T","S(z_T)","z_T","S(z_T)","z_T","S(z_T)","z_T","S(z_T)","z_T","S(z_T)","z_T","S(z_T)"]
[{"$f":"IDF!B8","v":10},{"$f":"B$5*(1+B$6)/B$6*(1-(1/($A14*B$4))^B$6)+B$3","v":44.753137891037561},{"$f":"SQRT(((1+B$6)*B$5*$A14*(B$4*$A14)^(-B$6-1))^2*B$7+((1+B$6)/B$6*(1-(1/($A14*B$4))^B$6))^2*B$8+((1+B$6)*B$5*((B$4*$A14)^(-B$6)/B$6*LN(B$4*$A14)-1/B$6^2*(1-(B$4*$A14)^(-B$6))))^2*B$9)","v":3.7409628688464718},{"$f":"D$5*(1+D$6)/D$6*(1-(1/($A14*D$4))^D$6)+D$3","v":38.012898456564123},{"$f":"SQRT(((1+D$6)*D$5*$A14*(D$4*$A14)^(-D$6-1))^2*D$7+((1+D$6)/D$6*(1-(1/($A14*D$4))^D$6))^2*D$8+((1+D$6)*D$5*((D$4*$A14)^(-D$6)/D$6*LN(D$4*$A14)-1/D$6^2*(1-(D$4*$A14)^(-D$6))))^2*D$9)","v":2.0958328111849984},{"$f":"F$5*(1+F$6)/F$6*(1-(1/($A14*F$4))^F$6)+F$3","v":28.861630277434401},{"$f":"SQRT(((1+F$6)*F$5*$A14*(F$4*$A14)^(-F$6-1))^2*F$7+((1+F$6)/F$6*(1-(1/($A14*F$4))^F$6))^2*F$8+((1+F$6)*F$5*((F$4*$A14)^(-F$6)/F$6*LN(F$4*$A14)-1/F$6^2*(1-(F$4*$A14)^(-F$6))))^2*F$9)","v":1.3804952976629403},{"$f":"H$5*(1+H$6)/H$6*(1-(1/($A14*H$4))^H$6)+H$3","v":20.92154415830348},{"$f":"SQRT(((1+H$6)*H$5*$A14*(H$4*$A14)^(-H$6-1))^2*H$7+((1+H$6)/H$6*(1-(1/($A14*H$4))^H$6))^2*H$8+((1+H$6)*H$5*((H$4*$A14)^(-H$6)/H$6*LN(H$4*$A14)-1/H$6^2*(1-(H$4*$A14)^(-H$6))))^2*H$9)","v":0.78667332899651998},{"$f":"J$5*(1+J$6)/J$6*(1-(1/($A14*J$4))^J$6)+J$3","v":11.010988100282876},{"$f":"SQRT(((1+J$6)*J$5*$A14*(J$4*$A14)^(-J$6-1))^2*J$7+((1+J$6)/J$6*(1-(1/($A14*J$4))^J$6))^2*J$8+((1+J$6)*J$5*((J$4*$A14)^(-J$6)/J$6*LN(J$4*$A14)-1/J$6^2*(1-(J$4*$A14)^(-J$6))))^2*J$9)","v":1.04390439190379},{"$f":"L$5*(1+L$6)/L$6*(1-(1/($A14*L$4))^L$6)+L$3","v":6.7196175625704662},{"$f":"SQRT(((1+L$6)*L$5*$A14*(L$4*$A14)^(-L$6-1))^2*L$7+((1+L$6)/L$6*(1-(1/($A14*L$4))^L$6))^2*L$8+((1+L$6)*L$5*((L$4*$A14)^(-L$6)/L$6*LN(L$4*$A14)-1/L$6^2*(1-(L$4*$A14)^(-L$6))))^2*L$9)","v":0.65487119438029429},{"$f":"N$5*(1+N$6)/N$6*(1-(1/($A14*N$4))^N$6)+N$3","v":3.1053781874779141},{"$f":"SQRT(((1+N$6)*N$5*$A14*(N$4*$A14)^(-N$6-1))^2*N$7+((1+N$6)/N$6*(1-(1/($A14*N$4))^N$6))^2*N$8+((1+N$6)*N$5*((N$4*$A14)^(-N$6)/N$6*LN(N$4*$A14)-1/N$6^2*(1-(N$4*$A14)^(-N$6))))^2*N$9)","v":0.32762122590161086},{"$f":"P$5*(1+P$6)/P$6*(1-(1/($A14*P$4))^P$6)+P$3","v":1.9039342515877768},{"$f":"SQRT(((1+P$6)*P$5*$A14*(P$4*$A14)^(-P$6-1))^2*P$7+((1+P$6)/P$6*(1-(1/($A14*P$4))^P$6))^2*P$8+((1+P$6)*P$5*((P$4*$A14)^(-P$6)/P$6*LN(P$4*$A14)-1/P$6^2*(1-(P$4*$A14)^(-P$6))))^2*P$9)","v":0.11366876352218724},{"$f":"R$5*(1+R$6)/R$6*(1-(1/($A14*R$4))^R$6)+R$3","v":1.1624217519411577},{"$f":"SQRT(((1+R$6)*R$5*$A14*(R$4*$A14)^(-R$6-1))^2*R$7+((1+R$6)/R$6*(1-(1/($A14*R$4))^R$6))^2*R$8+((1+R$6)*R$5*((R$4*$A14)^(-R$6)/R$6*LN(R$4*$A14)-1/R$6^2*(1-(R$4*$A14)^(-R$6))))^2*R$9)","v":7.1855447929520838E-2},{"$f":"T$5*(1+T$6)/T$6*(1-(1/($A14*T$4))^T$6)+T$3","v":0.68798398179738507},{"$f":"SQRT(((1+T$6)*T$5*$A14*(T$4*$A14)^(-T$6-1))^2*T$7+((1+T$6)/T$6*(1-(1/($A14*T$4))^T$6))^2*T$8+((1+T$6)*T$5*((T$4*$A14)^(-T$6)/T$6*LN(T$4*$A14)-1/T$6^2*(1-(T$4*$A14)^(-T$6))))^2*T$9)","v":4.3748978364370784E-2},{"$f":"V$5*(1+V$6)/V$6*(1-(1/($A14*V$4))^V$6)+V$3","v":0.38973850729396953},{"$f":"SQRT(((1+V$6)*V$5*$A14*(V$4*$A14)^(-V$6-1))^2*V$7+((1+V$6)/V$6*(1-(1/($A14*V$4))^V$6))^2*V$8+((1+V$6)*V$5*((V$4*$A14)^(-V$6)/V$6*LN(V$4*$A14)-1/V$6^2*(1-(V$4*$A14)^(-V$6))))^2*V$9)","v":2.6950094952377525E-2}]
[]
["Dur(min)","z_T","S_T"]
[1,{"$f":"B14","v":44.753137891037561},{"$f":"C14","v":3.7409628688464718}]
[2,{"$f":"D14","v":38.012898456564123},{"$f":"E14","v":2.0958328111849984}]
[5,{"$f":"F14","v":28.861630277434401},{"$f":"G14","v":1.3804952976629403}]
[10,{"$f":"H14","v":20.92154415830348},{"$f":"I14","v":0.78667332899651998}]
{"$rows_left_out":8}
{"sheet":"help3","index":5,"n_rows":32,"n_cols":18,"rows_kept":32,"cut":false,"hidden":true,"merged":[]}
["Variable",null,"bv1","bv2",null,null,null,null,null,null,null,null,"LAMBDA"]
[]
["z0",null,{"$f":"Q4","v":17.8},{"$f":"Q5","v":6.26},null,null,null,null,null,null,null,null,"Variable","b_0","b_1",null,"z_0","E(lambda)"]
["lambda",null,{"$f":"R4","v":2.6716217493112739},{"$f":"R5","v":2.9049596495686352},null,null,null,null,null,null,null,null,"bv1",-2.855,8.3840000000000008E-3,null,17.8,{"$f":"N4+O4*IDF!$B$5","v":2.6716217493112739}]
["mean",null,{"$f":"Q10","v":12.012207371918729},{"$f":"Q11","v":4.9800000000000004},null,null,null,null,null,null,null,null,"bv2",1.9319999999999999,1.4760000000000001E-3,null,6.26,{"$f":"N5+O5*IDF!$B$5","v":2.9049596495686352}]
["kappa",null,{"$f":"O17","v":-0.16412704240866516},{"$f":"O18","v":-0.22127356812522248}]
[null,null,null,null,null,null,null,null,null,null,null,null,"MEAN"]
[]
[null,null,null,null,null,null,"Incl. koblede regn, f-faktor 0, s-faktor 1",null,null,null,null,null,"Variable","b_0","b_1",null,"E(mean)"]
["T =",{"$f":"IDF!B8","v":10},{"$f":"C$5*(1+C$6)/C$6*(1-(1/($B10*C$4))^C$6)+C$3","v":61.518861740077242},{"$f":"D$5*(1+D$6)/D$6*(1-(1/($B10*D$4))^D$6)+D$3","v":25.668994934488552},null,0.1,{"$f":"C10","v":61.518861740077242},null,null,null,null,null,"bv1",-11.01,0.80720000000000003,null,{"$f":"N10+O10*IDF!B6","v":12.012207371918729}]
[null,null,null,null,null,1,{"$f":"D10","v":25.668994934488552},null,null,null,null,null,"bv2",4.9800000000000004,0,null,{"$f":"N11+O11*IDF!B6","v":4.9800000000000004}]
[]
[null,null,null,null,null,null,null,null,null,null,null,null,"L-CV"]
[]
[null,null,null,null,null,null,null,null,null,null,null,null,null,null,"Kappa"]
[null,null,null,null,null,null,null,null,null,null,null,null,"Variable","mean","mean"]
[null,null,null,null,null,null,null,null,null,null,null,null,"bv1",0.54469999999999996,{"$f":"1/N17-2","v":-0.16412704240866516}]
[null,null,null,null,null,null,null,null,null,null,null,null,"bv2",0.56220000000000003,{"$f":"1/N18-2","v":-0.22127356812522248}]
[]
[]
{"$rows_left_out":12}